{"text_format":"1","workbook":"xlsx","n_sheets":7,"sheets":["Leirat","Urlap","Korábbi napló","Munkanaplo","Elemzés","Adattár","Háttér"],"not_rendered":{"charts":4,"images":0,"macros":1,"external_links":0,"defined_names":1,"comments":0,"pivot_tables":0},"unopened":[],"bounds":{"document_bytes":16777216,"sheet_cells":100000,"rows_first":2000,"rows_last":500,"rows_between":2000,"halvings":0,"cell_chars":16384,"cell_head_chars":4096},"cells_cut":0,"cells_raw":0,"read":"whole","date_system":"1900"}

{"sheet":"Leirat","index":0,"n_rows":21,"n_cols":1,"rows_kept":21,"cut":false,"hidden":false,"merged":[[0,0,1,0]]}
["Mentori napló használati útmutató"]
[]
["A rehabilitációs mentori napló használata segítséget nyújthat az MMK munkavállalóval történt mentori találkozáson kinyert legfontosabb információk eltárolásához, előhívásához, majd a tendenciák követéséhez, a mentorált állapotának monitorozásához, a kockázatok azonosítása és a szükséges munkahelymegtartást elősegítő beavatkozások megvalósítása érdekében."]
[]
["A rehabilitációs mentori napló megfelelő használatához engedélyezni kell a Makró használatát!"]
["A naplót célirányosan 1-1 MMK munkavállaló nyomonkövetésére lehet használni."]
["1 napra csak 1 mentori napló bejegyzést lehet rögzíteni az Elemés diagramjainak használhatósága érdekében."]
[]
["A mentori találkozó adatait az Űrlapon szükséges rögzíteni, majd a bevitt adatokat az alkalmazás a Munkanapló lapra menti a Mentés gomb megnyomását követően, majd üríti a bevitt adatokat."]
["Az Űrlap 6-8. (szolgáltatás tartalma) és 34-40. (beavatkozások) sorai a Háttér lapon lévő választéklistát használják, ezen választéklistákat kedv (és a mentor által alkalmazott eszközök) szerint lehet szűkíteni (sor törlésével) vagy bővíteni (az új elem oszlop aljára történő beírásával)."]
{"$rows_left_out":12}
{"sheet":"Urlap","index":1,"n_rows":43,"n_cols":4,"rows_kept":43,"cut":false,"hidden":false,"merged":[[42,1,42,3],[31,1,31,3],[8,1,10,3],[8,0,10,0],[0,0,0,3],[31,0,32,0],[32,1,39,3],[40,1,40,3],[41,1,41,3]]}
["Rehabilitációs \nMENTORI NAPLÓ"]
[]
["Mentorált munkavállaló neve","Gipsz Jakab"]
["Munkakör","takarító"]
["Mentori szolgáltatás formája"]
["Szolgáltatás tartalma 1"]
["Szolgáltatás tartalma 2"]
["Szolgáltatás tartalma 3"]
["Elmúlt időszak rövid értékelése\n (szabadszöveges)"]
[]
{"$rows_left_out":34}
{"sheet":"Korábbi napló","index":2,"n_rows":43,"n_cols":4,"rows_kept":43,"cut":false,"hidden":false,"merged":[[40,1,40,3],[41,1,41,3],[42,1,42,3],[5,1,7,1],[11,2,11,3],[0,0,0,3],[8,0,10,0],[8,1,10,3],[31,0,32,0],[31,1,31,3],[32,1,39,3]]}
["KORÁBBI rehabilitációs mentori naplók\nmegtekintése"]
[]
["Mentorált munkavállaló neve","Gipsz Jakab"]
["Munkakör","takarító"]
["Mentori szolgáltatás formája"]
["Szolgáltatás tartalma 1",{"$f":"VLOOKUP(B12,Munkanaplo!E:BB,3,FALSE)","v":{"$error":"#N/A"}}]
["Szolgáltatás tartalma 2"]
["Szolgáltatás tartalma 3"]
["Elmúlt időszak rövid értékelése",{"$f":"VLOOKUP(B12,Munkanaplo!E:BB,16,FALSE)","v":{"$error":"#N/A"}}]
[]
{"$rows_left_out":34}
{"sheet":"Munkanaplo","index":3,"n_rows":97,"n_cols":55,"rows_kept":97,"cut":false,"hidden":false,"merged":[[0,54,1,54],[0,0,1,0],[0,18,1,18],[0,17,1,17],[0,7,0,16],[0,1,1,1],[0,2,1,2],[0,3,1,3],[0,4,1,4],[0,5,1,5],[0,6,1,6],[0,31,1,31],[0,32,1,32],[0,20,1,20],[0,19,1,19],[0,53,1,53],[0,44,0,50],[0,51,1,51],[0,52,1,52],[0,33,0,42],[0,21,0,30]]}
["Szolgáltatási alkalom sorszáma","Mentorált munkavállaló neve","Munkakör","Mentori szolgáltatás formája","Szolgáltatás dátuma","Értékelt időszak (nap)","Szolgáltatás tartalma","Kockázatok (1-5)",null,null,null,null,null,null,null,null,null,"Összesített kockázati szint (max)","Kritikus helyzet?","Elmúlt időszak rövid értékelése","Azonosított, megoldandó problémák és javaslatok (szabadszöveges)","ÖNÉRTÉKELÉS - Megállapítás, értékelés (1-5)",null,null,null,null,null,null,null,null,null,"Kockázat szint átlaga","Megfelelőségi szint átlaga","Megállapítás, értékelés (szöveges)",null,null,null,null,null,null,null,null,null,null,"Szükséges beavatkozások, kimenetek",null,null,null,null,null,null,"Mentorált által vállalt feladatok:","Egyéb, kiegészítő információk","Következő alkalom:","Sorszám"]
[null,null,null,null,null,null,null,"Egészségi állapot","Családi, támogató közeg","Beilleszkedés, kollegiális kapcsolatok","Felettessel való viszony","Munkakörnyezet akadálymentessége","Munkaköri feladatok ellátása","Munkavállalói teljesítmény","Munkából való hiányzás","Egyéb problémák, nehézségek","Egyéb …",null,null,null,null,"Egészségi állapot","Családi, támogató közeg","Beilleszkedés, kollegiális kapcsolatok","Felettessel való viszony","Munkakörnyezet akadálymentessége","Munkaköri feladatok ellátása","Munkavállalói teljesítmény","Munkából való hiányzás","Egyéb problémák, nehézségek","Egyéb …",null,null,"Egészségi állapot","Családi, támogató közeg","Beilleszkedés, kollegiális kapcsolatok","Felettessel való viszony","Munkakörnyezet akadálymentessége","Munkaköri feladatok ellátása","Munkavállalói teljesítmény","Munkából való hiányzás","Egyéb problémák, nehézségek","Egyéb …",null,1,2,3,4,5,6,7]
[null,null,null,null,null,null,null,null,null,null,null,null,null,null,null,null,null,null,null,null,null,null,null,null,null,null,null,null,null,null,null,null,null,null,null,null,null,null,null,null,null,null,null,null,null,null,null,null,null,null,null,null,null,null,{"$f":"A3","v":0}]
[null,null,null,null,null,null,null,null,null,null,null,null,null,null,null,null,null,null,null,null,null,null,null,null,null,null,null,null,null,null,null,null,null,null,null,null,null,null,null,null,null,null,null,null,null,null,null,null,null,null,null,null,null,null,0]
[null,null,null,null,null,null,null,null,null,null,null,null,null,null,null,null,null,null,null,null,null,null,null,null,null,null,null,null,null,null,null,null,null,null,null,null,null,null,null,null,null,null,null,null,null,null,null,null,null,null,null,null,null,null,0]
[null,null,null,null,null,null,null,null,null,null,null,null,null,null,null,null,null,null,null,null,null,null,null,null,null,null,null,null,null,null,null,null,null,null,null,null,null,null,null,null,null,null,null,null,null,null,null,null,null,null,null,null,null,null,0]
[null,null,null,null,null,null,null,null,null,null,null,null,null,null,null,null,null,null,null,null,null,null,null,null,null,null,null,null,null,null,null,null,null,null,null,null,null,null,null,null,null,null,null,null,null,null,null,null,null,null,null,null,null,null,0]
[null,null,null,null,null,null,null,null,null,null,null,null,null,null,null,null,null,null,null,null,null,null,null,null,null,null,null,null,null,null,null,null,null,null,null,null,null,null,null,null,null,null,null,null,null,null,null,null,null,null,null,null,null,null,0]
[null,null,null,null,null,null,null,null,null,null,null,null,null,null,null,null,null,null,null,null,null,null,null,null,null,null,null,null,null,null,null,null,null,null,null,null,null,null,null,null,null,null,null,null,null,null,null,null,null,null,null,null,null,null,0]
[null,null,null,null,null,null,null,null,null,null,null,null,null,null,null,null,null,null,null,null,null,null,null,null,null,null,null,null,null,null,null,null,null,null,null,null,null,null,null,null,null,null,null,null,null,null,null,null,null,null,null,null,null,null,0]
{"$rows_left_out":88}
{"sheet":"Elemzés","index":4,"n_rows":2,"n_cols":11,"rows_kept":2,"cut":false,"hidden":false,"merged":[]}
[]
[null,null,null,null,null,null,null,null,null,null,"Önértékelés és kockázatok időbeli alakulása"]

{"sheet":"Adattár","index":5,"n_rows":101,"n_cols":24,"rows_kept":101,"cut":false,"hidden":false,"merged":[[0,13,0,22],[0,23,1,23],[0,1,0,10]]}
[null,null,null,null,null,null,null,null,null,null,null,null,null,"Megállapítás, értékelés (1-5)",null,null,null,null,null,null,null,null,null,"Megfelelőségi szint átlaga"]
["Szolgáltatás dátuma","Egészségi állapot","Családi, támogató közeg","Beilleszkedés, kollegiális kapcsolatok","Felettessel való viszony","Munkakörnyezet akadálymentessége","Munkaköri feladatok ellátása","Munkavállalói teljesítmény","Munkából való hiányzás","Egyéb problémák, nehézségek","Egyéb …","Összesített kockázati szint (max)","Kockázat szint átlaga","Egészségi állapot","Családi, támogató közeg","Beilleszkedés, kollegiális kapcsolatok","Felettessel való viszony","Munkakörnyezet akadálymentessége","Munkaköri feladatok ellátása","Munkavállalói teljesítmény","Munkából való hiányzás","Egyéb problémák, nehézségek","Egyéb …"]
[{"$f":"IF(Munkanaplo!E3>0,Munkanaplo!E3,\"\")","v":""},{"$f":"IF(Munkanaplo!H3>0,Munkanaplo!H3,\"\")","v":""},{"$f":"IF(Munkanaplo!I3>0,Munkanaplo!I3,\"\")","v":""},{"$f":"IF(Munkanaplo!J3>0,Munkanaplo!J3,\"\")","v":""},{"$f":"IF(Munkanaplo!K3>0,Munkanaplo!K3,\"\")","v":""},{"$f":"IF(Munkanaplo!L3>0,Munkanaplo!L3,\"\")","v":""},{"$f":"IF(Munkanaplo!M3>0,Munkanaplo!M3,\"\")","v":""},{"$f":"IF(Munkanaplo!N3>0,Munkanaplo!N3,\"\")","v":""},{"$f":"IF(Munkanaplo!O3>0,Munkanaplo!O3,\"\")","v":""},{"$f":"IF(Munkanaplo!P3>0,Munkanaplo!P3,\"\")","v":""},{"$f":"IF(Munkanaplo!Q3>0,Munkanaplo!Q3,\"\")","v":""},{"$f":"IFERROR(IF(Munkanaplo!R3>0,Munkanaplo!R3,\"\")/5,\"\")","v":""},{"$f":"IF(Munkanaplo!AF3>0,Munkanaplo!AF3,\"\")","v":""},{"$f":"IF(Munkanaplo!V3>0,Munkanaplo!V3,\"\")","v":""},{"$f":"IF(Munkanaplo!W3>0,Munkanaplo!W3,\"\")","v":""},{"$f":"IF(Munkanaplo!X3>0,Munkanaplo!X3,\"\")","v":""},{"$f":"IF(Munkanaplo!Y3>0,Munkanaplo!Y3,\"\")","v":""},{"$f":"IF(Munkanaplo!Z3>0,Munkanaplo!Z3,\"\")","v":""},{"$f":"IF(Munkanaplo!AA3>0,Munkanaplo!AA3,\"\")","v":""},{"$f":"IF(Munkanaplo!AB3>0,Munkanaplo!AB3,\"\")","v":""},{"$f":"IF(Munkanaplo!AC3>0,Munkanaplo!AC3,\"\")","v":""},{"$f":"IF(Munkanaplo!AD3>0,Munkanaplo!AD3,\"\")","v":""},{"$f":"IF(Munkanaplo!AE3>0,Munkanaplo!AE3,\"\")","v":""},{"$f":"IF(Munkanaplo!AG3>0,Munkanaplo!AG3,\"\")","v":""}]
[{"$f":"IF(Munkanaplo!E4>0,Munkanaplo!E4,\"\")","v":""},{"$f":"IF(Munkanaplo!H4>0,Munkanaplo!H4,\"\")","v":""},{"$f":"IF(Munkanaplo!I4>0,Munkanaplo!I4,\"\")","v":""},{"$f":"IF(Munkanaplo!J4>0,Munkanaplo!J4,\"\")","v":""},{"$f":"IF(Munkanaplo!K4>0,Munkanaplo!K4,\"\")","v":""},{"$f":"IF(Munkanaplo!L4>0,Munkanaplo!L4,\"\")","v":""},{"$f":"IF(Munkanaplo!M4>0,Munkanaplo!M4,\"\")","v":""},{"$f":"IF(Munkanaplo!N4>0,Munkanaplo!N4,\"\")","v":""},{"$f":"IF(Munkanaplo!O4>0,Munkanaplo!O4,\"\")","v":""},{"$f":"IF(Munkanaplo!P4>0,Munkanaplo!P4,\"\")","v":""},{"$f":"IF(Munkanaplo!Q4>0,Munkanaplo!Q4,\"\")","v":""},{"$f":"IFERROR(IF(Munkanaplo!R4>0,Munkanaplo!R4,\"\")/5,\"\")","v":""},{"$f":"IF(Munkanaplo!AF4>0,Munkanaplo!AF4,\"\")","v":""},{"$f":"IF(Munkanaplo!V4>0,Munkanaplo!V4,\"\")","v":""},{"$f":"IF(Munkanaplo!W4>0,Munkanaplo!W4,\"\")","v":""},{"$f":"IF(Munkanaplo!X4>0,Munkanaplo!X4,\"\")","v":""},{"$f":"IF(Munkanaplo!Y4>0,Munkanaplo!Y4,\"\")","v":""},{"$f":"IF(Munkanaplo!Z4>0,Munkanaplo!Z4,\"\")","v":""},{"$f":"IF(Munkanaplo!AA4>0,Munkanaplo!AA4,\"\")","v":""},{"$f":"IF(Munkanaplo!AB4>0,Munkanaplo!AB4,\"\")","v":""},{"$f":"IF(Munkanaplo!AC4>0,Munkanaplo!AC4,\"\")","v":""},{"$f":"IF(Munkanaplo!AD4>0,Munkanaplo!AD4,\"\")","v":""},{"$f":"IF(Munkanaplo!AE4>0,Munkanaplo!AE4,\"\")","v":""},{"$f":"IF(Munkanaplo!AG4>0,Munkanaplo!AG4,\"\")","v":""}]
[{"$f":"IF(Munkanaplo!E5>0,Munkanaplo!E5,\"\")","v":""},{"$f":"IF(Munkanaplo!H5>0,Munkanaplo!H5,\"\")","v":""},{"$f":"IF(Munkanaplo!I5>0,Munkanaplo!I5,\"\")","v":""},{"$f":"IF(Munkanaplo!J5>0,Munkanaplo!J5,\"\")","v":""},{"$f":"IF(Munkanaplo!K5>0,Munkanaplo!K5,\"\")","v":""},{"$f":"IF(Munkanaplo!L5>0,Munkanaplo!L5,\"\")","v":""},{"$f":"IF(Munkanaplo!M5>0,Munkanaplo!M5,\"\")","v":""},{"$f":"IF(Munkanaplo!N5>0,Munkanaplo!N5,\"\")","v":""},{"$f":"IF(Munkanaplo!O5>0,Munkanaplo!O5,\"\")","v":""},{"$f":"IF(Munkanaplo!P5>0,Munkanaplo!P5,\"\")","v":""},{"$f":"IF(Munkanaplo!Q5>0,Munkanaplo!Q5,\"\")","v":""},{"$f":"IFERROR(IF(Munkanaplo!R5>0,Munkanaplo!R5,\"\")/5,\"\")","v":""},{"$f":"IF(Munkanaplo!AF5>0,Munkanaplo!AF5,\"\")","v":""},{"$f":"IF(Munkanaplo!V5>0,Munkanaplo!V5,\"\")","v":""},{"$f":"IF(Munkanaplo!W5>0,Munkanaplo!W5,\"\")","v":""},{"$f":"IF(Munkanaplo!X5>0,Munkanaplo!X5,\"\")","v":""},{"$f":"IF(Munkanaplo!Y5>0,Munkanaplo!Y5,\"\")","v":""},{"$f":"IF(Munkanaplo!Z5>0,Munkanaplo!Z5,\"\")","v":""},{"$f":"IF(Munkanaplo!AA5>0,Munkanaplo!AA5,\"\")","v":""},{"$f":"IF(Munkanaplo!AB5>0,Munkanaplo!AB5,\"\")","v":""},{"$f":"IF(Munkanaplo!AC5>0,Munkanaplo!AC5,\"\")","v":""},{"$f":"IF(Munkanaplo!AD5>0,Munkanaplo!AD5,\"\")","v":""},{"$f":"IF(Munkanaplo!AE5>0,Munkanaplo!AE5,\"\")","v":""},{"$f":"IF(Munkanaplo!AG5>0,Munkanaplo!AG5,\"\")","v":""}]
[{"$f":"IF(Munkanaplo!E6>0,Munkanaplo!E6,\"\")","v":""},{"$f":"IF(Munkanaplo!H6>0,Munkanaplo!H6,\"\")","v":""},{"$f":"IF(Munkanaplo!I6>0,Munkanaplo!I6,\"\")","v":""},{"$f":"IF(Munkanaplo!J6>0,Munkanaplo!J6,\"\")","v":""},{"$f":"IF(Munkanaplo!K6>0,Munkanaplo!K6,\"\")","v":""},{"$f":"IF(Munkanaplo!L6>0,Munkanaplo!L6,\"\")","v":""},{"$f":"IF(Munkanaplo!M6>0,Munkanaplo!M6,\"\")","v":""},{"$f":"IF(Munkanaplo!N6>0,Munkanaplo!N6,\"\")","v":""},{"$f":"IF(Munkanaplo!O6>0,Munkanaplo!O6,\"\")","v":""},{"$f":"IF(Munkanaplo!P6>0,Munkanaplo!P6,\"\")","v":""},{"$f":"IF(Munkanaplo!Q6>0,Munkanaplo!Q6,\"\")","v":""},{"$f":"IFERROR(IF(Munkanaplo!R6>0,Munkanaplo!R6,\"\")/5,\"\")","v":""},{"$f":"IF(Munkanaplo!AF6>0,Munkanaplo!AF6,\"\")","v":""},{"$f":"IF(Munkanaplo!V6>0,Munkanaplo!V6,\"\")","v":""},{"$f":"IF(Munkanaplo!W6>0,Munkanaplo!W6,\"\")","v":""},{"$f":"IF(Munkanaplo!X6>0,Munkanaplo!X6,\"\")","v":""},{"$f":"IF(Munkanaplo!Y6>0,Munkanaplo!Y6,\"\")","v":""},{"$f":"IF(Munkanaplo!Z6>0,Munkanaplo!Z6,\"\")","v":""},{"$f":"IF(Munkanaplo!AA6>0,Munkanaplo!AA6,\"\")","v":""},{"$f":"IF(Munkanaplo!AB6>0,Munkanaplo!AB6,\"\")","v":""},{"$f":"IF(Munkanaplo!AC6>0,Munkanaplo!AC6,\"\")","v":""},{"$f":"IF(Munkanaplo!AD6>0,Munkanaplo!AD6,\"\")","v":""},{"$f":"IF(Munkanaplo!AE6>0,Munkanaplo!AE6,\"\")","v":""},{"$f":"IF(Munkanaplo!AG6>0,Munkanaplo!AG6,\"\")","v":""}]
[{"$f":"IF(Munkanaplo!E7>0,Munkanaplo!E7,\"\")","v":""},{"$f":"IF(Munkanaplo!H7>0,Munkanaplo!H7,\"\")","v":""},{"$f":"IF(Munkanaplo!I7>0,Munkanaplo!I7,\"\")","v":""},{"$f":"IF(Munkanaplo!J7>0,Munkanaplo!J7,\"\")","v":""},{"$f":"IF(Munkanaplo!K7>0,Munkanaplo!K7,\"\")","v":""},{"$f":"IF(Munkanaplo!L7>0,Munkanaplo!L7,\"\")","v":""},{"$f":"IF(Munkanaplo!M7>0,Munkanaplo!M7,\"\")","v":""},{"$f":"IF(Munkanaplo!N7>0,Munkanaplo!N7,\"\")","v":""},{"$f":"IF(Munkanaplo!O7>0,Munkanaplo!O7,\"\")","v":""},{"$f":"IF(Munkanaplo!P7>0,Munkanaplo!P7,\"\")","v":""},{"$f":"IF(Munkanaplo!Q7>0,Munkanaplo!Q7,\"\")","v":""},{"$f":"IFERROR(IF(Munkanaplo!R7>0,Munkanaplo!R7,\"\")/5,\"\")","v":""},{"$f":"IF(Munkanaplo!AF7>0,Munkanaplo!AF7,\"\")","v":""},{"$f":"IF(Munkanaplo!V7>0,Munkanaplo!V7,\"\")","v":""},{"$f":"IF(Munkanaplo!W7>0,Munkanaplo!W7,\"\")","v":""},{"$f":"IF(Munkanaplo!X7>0,Munkanaplo!X7,\"\")","v":""},{"$f":"IF(Munkanaplo!Y7>0,Munkanaplo!Y7,\"\")","v":""},{"$f":"IF(Munkanaplo!Z7>0,Munkanaplo!Z7,\"\")","v":""},{"$f":"IF(Munkanaplo!AA7>0,Munkanaplo!AA7,\"\")","v":""},{"$f":"IF(Munkanaplo!AB7>0,Munkanaplo!AB7,\"\")","v":""},{"$f":"IF(Munkanaplo!AC7>0,Munkanaplo!AC7,\"\")","v":""},{"$f":"IF(Munkanaplo!AD7>0,Munkanaplo!AD7,\"\")","v":""},{"$f":"IF(Munkanaplo!AE7>0,Munkanaplo!AE7,\"\")","v":""},{"$f":"IF(Munkanaplo!AG7>0,Munkanaplo!AG7,\"\")","v":""}]
[{"$f":"IF(Munkanaplo!E8>0,Munkanaplo!E8,\"\")","v":""},{"$f":"IF(Munkanaplo!H8>0,Munkanaplo!H8,\"\")","v":""},{"$f":"IF(Munkanaplo!I8>0,Munkanaplo!I8,\"\")","v":""},{"$f":"IF(Munkanaplo!J8>0,Munkanaplo!J8,\"\")","v":""},{"$f":"IF(Munkanaplo!K8>0,Munkanaplo!K8,\"\")","v":""},{"$f":"IF(Munkanaplo!L8>0,Munkanaplo!L8,\"\")","v":""},{"$f":"IF(Munkanaplo!M8>0,Munkanaplo!M8,\"\")","v":""},{"$f":"IF(Munkanaplo!N8>0,Munkanaplo!N8,\"\")","v":""},{"$f":"IF(Munkanaplo!O8>0,Munkanaplo!O8,\"\")","v":""},{"$f":"IF(Munkanaplo!P8>0,Munkanaplo!P8,\"\")","v":""},{"$f":"IF(Munkanaplo!Q8>0,Munkanaplo!Q8,\"\")","v":""},{"$f":"IFERROR(IF(Munkanaplo!R8>0,Munkanaplo!R8,\"\")/5,\"\")","v":""},{"$f":"IF(Munkanaplo!AF8>0,Munkanaplo!AF8,\"\")","v":""},{"$f":"IF(Munkanaplo!V8>0,Munkanaplo!V8,\"\")","v":""},{"$f":"IF(Munkanaplo!W8>0,Munkanaplo!W8,\"\")","v":""},{"$f":"IF(Munkanaplo!X8>0,Munkanaplo!X8,\"\")","v":""},{"$f":"IF(Munkanaplo!Y8>0,Munkanaplo!Y8,\"\")","v":""},{"$f":"IF(Munkanaplo!Z8>0,Munkanaplo!Z8,\"\")","v":""},{"$f":"IF(Munkanaplo!AA8>0,Munkanaplo!AA8,\"\")","v":""},{"$f":"IF(Munkanaplo!AB8>0,Munkanaplo!AB8,\"\")","v":""},{"$f":"IF(Munkanaplo!AC8>0,Munkanaplo!AC8,\"\")","v":""},{"$f":"IF(Munkanaplo!AD8>0,Munkanaplo!AD8,\"\")","v":""},{"$f":"IF(Munkanaplo!AE8>0,Munkanaplo!AE8,\"\")","v":""},{"$f":"IF(Munkanaplo!AG8>0,Munkanaplo!AG8,\"\")","v":""}]
[{"$f":"IF(Munkanaplo!E9>0,Munkanaplo!E9,\"\")","v":""},{"$f":"IF(Munkanaplo!H9>0,Munkanaplo!H9,\"\")","v":""},{"$f":"IF(Munkanaplo!I9>0,Munkanaplo!I9,\"\")","v":""},{"$f":"IF(Munkanaplo!J9>0,Munkanaplo!J9,\"\")","v":""},{"$f":"IF(Munkanaplo!K9>0,Munkanaplo!K9,\"\")","v":""},{"$f":"IF(Munkanaplo!L9>0,Munkanaplo!L9,\"\")","v":""},{"$f":"IF(Munkanaplo!M9>0,Munkanaplo!M9,\"\")","v":""},{"$f":"IF(Munkanaplo!N9>0,Munkanaplo!N9,\"\")","v":""},{"$f":"IF(Munkanaplo!O9>0,Munkanaplo!O9,\"\")","v":""},{"$f":"IF(Munkanaplo!P9>0,Munkanaplo!P9,\"\")","v":""},{"$f":"IF(Munkanaplo!Q9>0,Munkanaplo!Q9,\"\")","v":""},{"$f":"IFERROR(IF(Munkanaplo!R9>0,Munkanaplo!R9,\"\")/5,\"\")","v":""},{"$f":"IF(Munkanaplo!AF9>0,Munkanaplo!AF9,\"\")","v":""},{"$f":"IF(Munkanaplo!V9>0,Munkanaplo!V9,\"\")","v":""},{"$f":"IF(Munkanaplo!W9>0,Munkanaplo!W9,\"\")","v":""},{"$f":"IF(Munkanaplo!X9>0,Munkanaplo!X9,\"\")","v":""},{"$f":"IF(Munkanaplo!Y9>0,Munkanaplo!Y9,\"\")","v":""},{"$f":"IF(Munkanaplo!Z9>0,Munkanaplo!Z9,\"\")","v":""},{"$f":"IF(Munkanaplo!AA9>0,Munkanaplo!AA9,\"\")","v":""},{"$f":"IF(Munkanaplo!AB9>0,Munkanaplo!AB9,\"\")","v":""},{"$f":"IF(Munkanaplo!AC9>0,Munkanaplo!AC9,\"\")","v":""},{"$f":"IF(Munkanaplo!AD9>0,Munkanaplo!AD9,\"\")","v":""},{"$f":"IF(Munkanaplo!AE9>0,Munkanaplo!AE9,\"\")","v":""},{"$f":"IF(Munkanaplo!AG9>0,Munkanaplo!AG9,\"\")","v":""}]
[{"$f":"IF(Munkanaplo!E10>0,Munkanaplo!E10,\"\")","v":""},{"$f":"IF(Munkanaplo!H10>0,Munkanaplo!H10,\"\")","v":""},{"$f":"IF(Munkanaplo!I10>0,Munkanaplo!I10,\"\")","v":""},{"$f":"IF(Munkanaplo!J10>0,Munkanaplo!J10,\"\")","v":""},{"$f":"IF(Munkanaplo!K10>0,Munkanaplo!K10,\"\")","v":""},{"$f":"IF(Munkanaplo!L10>0,Munkanaplo!L10,\"\")","v":""},{"$f":"IF(Munkanaplo!M10>0,Munkanaplo!M10,\"\")","v":""},{"$f":"IF(Munkanaplo!N10>0,Munkanaplo!N10,\"\")","v":""},{"$f":"IF(Munkanaplo!O10>0,Munkanaplo!O10,\"\")","v":""},{"$f":"IF(Munkanaplo!P10>0,Munkanaplo!P10,\"\")","v":""},{"$f":"IF(Munkanaplo!Q10>0,Munkanaplo!Q10,\"\")","v":""},{"$f":"IFERROR(IF(Munkanaplo!R10>0,Munkanaplo!R10,\"\")/5,\"\")","v":""},{"$f":"IF(Munkanaplo!AF10>0,Munkanaplo!AF10,\"\")","v":""},{"$f":"IF(Munkanaplo!V10>0,Munkanaplo!V10,\"\")","v":""},{"$f":"IF(Munkanaplo!W10>0,Munkanaplo!W10,\"\")","v":""},{"$f":"IF(Munkanaplo!X10>0,Munkanaplo!X10,\"\")","v":""},{"$f":"IF(Munkanaplo!Y10>0,Munkanaplo!Y10,\"\")","v":""},{"$f":"IF(Munkanaplo!Z10>0,Munkanaplo!Z10,\"\")","v":""},{"$f":"IF(Munkanaplo!AA10>0,Munkanaplo!AA10,\"\")","v":""},{"$f":"IF(Munkanaplo!AB10>0,Munkanaplo!AB10,\"\")","v":""},{"$f":"IF(Munkanaplo!AC10>0,Munkanaplo!AC10,\"\")","v":""},{"$f":"IF(Munkanaplo!AD10>0,Munkanaplo!AD10,\"\")","v":""},{"$f":"IF(Munkanaplo!AE10>0,Munkanaplo!AE10,\"\")","v":""},{"$f":"IF(Munkanaplo!AG10>0,Munkanaplo!AG10,\"\")","v":""}]
{"$rows_left_out":92}
{"sheet":"Háttér","index":6,"n_rows":31,"n_cols":3,"rows_kept":31,"cut":false,"hidden":false,"merged":[]}
["Személyes szolgálatások","Megvalósítandó lépések","Szolgáltatás formája"]
["Beilleszkedés elősegítése","Akadálymentesítés","személyes egyéni"]
["Betanítás","Befogadó szervezeti kultúra kialakítása","telementorálás"]
["Értékelés","Beilleszkedés elősegítése","csoportos"]
["Képesség- és helyzetfelmérés","Betanítás","egyéb"]
["Kompetenciafejlesztés","CSR kommunikáció"]
["Kulturális és sport tevékenység szervezése","Családi kapcsolatok"]
["Mediáció, konfliktuskezelés","Értékelés"]
["Mentorált nyomonkövetése","Foglalkozási rehabilitációs tudásbővítés"]
["Mentori találkozó","FR szolgáltatás nyújtása mentoráltnak"]
{"$rows_left_out":21}